[SWS-720] samples build failure Created: 21/Jul/11  Updated: 04/May/12  Resolved: 06/Oct/11

Status: Closed
Project: Spring Web Services
Component/s: Samples
Affects Version/s: 2.0.2
Fix Version/s: 2.0.3

Type: Bug Priority: Major
Reporter: Jason Pyeron Assignee: Arjen Poutsma
Resolution: Fixed Votes: 0
Labels: None
Remaining Estimate: Not Specified
Time Spent: Not Specified
Original Estimate: Not Specified


 Description   

$ rm -rf newrepo; mvn -Dmaven.repo.local=newrepo -X
Apache Maven 3.0.3 (r1075438; 2011-02-28 12:31:09-0500)
Maven home: C:\Program Files\Apache Software Foundation\apache-maven-3.0.3
Java version: 1.6.0_26, vendor: Sun Microsystems Inc.
Java home: C:\Program Files\Java\jdk1.6.0_26\jre
Default locale: en_US, platform encoding: Cp1252
OS name: "windows xp", version: "5.2", arch: "amd64", family: "windows"
[INFO] Error stacktraces are turned on.
[DEBUG] Reading global settings from C:\Program Files\Apache Software Foundation\apache-maven-3.0.3\conf\settings.xml
[DEBUG] Reading user settings from C:\Documents and Settings\jpyeron\.m2\settings.xml
[DEBUG] Using local repository at C:\Documents and Settings\jpyeron\Desktop\spring-ws-2.0.2.RELEASE\samples\newrepo
[DEBUG] Using manager EnhancedLocalRepositoryManager with priority 10 for C:\Documents and Settings\jpyeron\Desktop\spring-ws-2.0.2.RELEASE\samples\newrepo
[INFO] Scanning for projects...
[DEBUG] Using connector WagonRepositoryConnector with priority 0 for http://repo1.maven.org/maven2
Downloading: http://repo1.maven.org/maven2/org/springframework/ws/spring-ws-parent/2.0.2.RELEASE/spring-ws-parent-2.0.2.RELEASE.pom
Downloaded: http://repo1.maven.org/maven2/org/springframework/ws/spring-ws-parent/2.0.2.RELEASE/spring-ws-parent-2.0.2.RELEASE.pom (31 KB at 85.6 KB/sec)
[DEBUG] Reading resolution tracking file C:\Documents and Settings\jpyeron\Desktop\spring-ws-2.0.2.RELEASE\samples\newrepo\org\springframework\ws\spring-ws-parent\2.0.2.RELEASE\spring-ws-parent-2.0.2.RELEASE.pom.lastUpdated
[DEBUG] Writing resolution tracking file C:\Documents and Settings\jpyeron\Desktop\spring-ws-2.0.2.RELEASE\samples\newrepo\org\springframework\ws\spring-ws-parent\2.0.2.RELEASE\spring-ws-parent-2.0.2.RELEASE.pom.lastUpdated
[DEBUG] Using connector WagonRepositoryConnector with priority 0 for http://repo1.maven.org/maven2
Downloading: http://repo1.maven.org/maven2/org/springframework/ws/spring-ws-samples/2.0.2.RELEASE/spring-ws-samples-2.0.2.RELEASE.pom
[DEBUG] Reading resolution tracking file C:\Documents and Settings\jpyeron\Desktop\spring-ws-2.0.2.RELEASE\samples\newrepo\org\springframework\ws\spring-ws-samples\2.0.2.RELEASE\spring-ws-samples-2.0.2.RELEASE.pom.lastUpdated
[DEBUG] Writing resolution tracking file C:\Documents and Settings\jpyeron\Desktop\spring-ws-2.0.2.RELEASE\samples\newrepo\org\springframework\ws\spring-ws-samples\2.0.2.RELEASE\spring-ws-samples-2.0.2.RELEASE.pom.lastUpdated
[DEBUG] Using connector WagonRepositoryConnector with priority 0 for http://repository.springsource.com/maven/bundles/release/
Downloading: http://repository.springsource.com/maven/bundles/release/org/springframework/build/aws/org.springframework.build.aws.maven/3.1.0.RELEASE/org.springframework.build.aws.maven-3.1.0.RELEASE.pom
[DEBUG] Reading resolution tracking file C:\Documents and Settings\jpyeron\Desktop\spring-ws-2.0.2.RELEASE\samples\newrepo\org\springframework\build\aws\org.springframework.build.aws.maven\3.1.0.RELEASE\org.springframework.build.aws.maven-3.1.0.RELEASE.pom.lastUpdated
[DEBUG] Writing resolution tracking file C:\Documents and Settings\jpyeron\Desktop\spring-ws-2.0.2.RELEASE\samples\newrepo\org\springframework\build\aws\org.springframework.build.aws.maven\3.1.0.RELEASE\org.springframework.build.aws.maven-3.1.0.RELEASE.pom.lastUpdated
[DEBUG] Using connector WagonRepositoryConnector with priority 0 for http://repo1.maven.org/maven2
Downloading: http://repo1.maven.org/maven2/org/springframework/build/aws/org.springframework.build.aws.maven/3.1.0.RELEASE/org.springframework.build.aws.maven-3.1.0.RELEASE.pom
[DEBUG] Reading resolution tracking file C:\Documents and Settings\jpyeron\Desktop\spring-ws-2.0.2.RELEASE\samples\newrepo\org\springframework\build\aws\org.springframework.build.aws.maven\3.1.0.RELEASE\org.springframework.build.aws.maven-3.1.0.RELEASE.pom.lastUpdated
[DEBUG] Writing resolution tracking file C:\Documents and Settings\jpyeron\Desktop\spring-ws-2.0.2.RELEASE\samples\newrepo\org\springframework\build\aws\org.springframework.build.aws.maven\3.1.0.RELEASE\org.springframework.build.aws.maven-3.1.0.RELEASE.pom.lastUpdated
[WARNING] The POM for org.springframework.build.aws:org.springframework.build.aws.maven:jar:3.1.0.RELEASE is missing, no dependency information available
[DEBUG] org.springframework.build.aws:org.springframework.build.aws.maven:jar:3.1.0.RELEASE:
[DEBUG]    org.codehaus.plexus:plexus-utils:jar:1.1:runtime
[DEBUG] Using connector WagonRepositoryConnector with priority 0 for http://repository.springsource.com/maven/bundles/release/
Downloading: http://repository.springsource.com/maven/bundles/release/org/codehaus/plexus/plexus-utils/1.1/plexus-utils-1.1.jar
Downloading: http://repository.springsource.com/maven/bundles/release/org/springframework/build/aws/org.springframework.build.aws.maven/3.1.0.RELEASE/org.springframework.build.aws.maven-3.1.0.RELEASE.jar
[DEBUG] Reading resolution tracking file C:\Documents and Settings\jpyeron\Desktop\spring-ws-2.0.2.RELEASE\samples\newrepo\org\springframework\build\aws\org.springframework.build.aws.maven\3.1.0.RELEASE\org.springframework.build.aws.maven-3.1.0.RELEASE.jar.lastUpdated
[DEBUG] Writing resolution tracking file C:\Documents and Settings\jpyeron\Desktop\spring-ws-2.0.2.RELEASE\samples\newrepo\org\springframework\build\aws\org.springframework.build.aws.maven\3.1.0.RELEASE\org.springframework.build.aws.maven-3.1.0.RELEASE.jar.lastUpdated
[DEBUG] Reading resolution tracking file C:\Documents and Settings\jpyeron\Desktop\spring-ws-2.0.2.RELEASE\samples\newrepo\org\codehaus\plexus\plexus-utils\1.1\plexus-utils-1.1.jar.lastUpdated
[DEBUG] Writing resolution tracking file C:\Documents and Settings\jpyeron\Desktop\spring-ws-2.0.2.RELEASE\samples\newrepo\org\codehaus\plexus\plexus-utils\1.1\plexus-utils-1.1.jar.lastUpdated
[DEBUG] Using connector WagonRepositoryConnector with priority 0 for http://repo1.maven.org/maven2
Downloading: http://repo1.maven.org/maven2/org/springframework/build/aws/org.springframework.build.aws.maven/3.1.0.RELEASE/org.springframework.build.aws.maven-3.1.0.RELEASE.jar
Downloading: http://repo1.maven.org/maven2/org/codehaus/plexus/plexus-utils/1.1/plexus-utils-1.1.jar
Downloaded: http://repo1.maven.org/maven2/org/codehaus/plexus/plexus-utils/1.1/plexus-utils-1.1.jar (165 KB at 215.2 KB/sec)
[DEBUG] Reading resolution tracking file C:\Documents and Settings\jpyeron\Desktop\spring-ws-2.0.2.RELEASE\samples\newrepo\org\springframework\build\aws\org.springframework.build.aws.maven\3.1.0.RELEASE\org.springframework.build.aws.maven-3.1.0.RELEASE.jar.lastUpdated
[DEBUG] Writing resolution tracking file C:\Documents and Settings\jpyeron\Desktop\spring-ws-2.0.2.RELEASE\samples\newrepo\org\springframework\build\aws\org.springframework.build.aws.maven\3.1.0.RELEASE\org.springframework.build.aws.maven-3.1.0.RELEASE.jar.lastUpdated
[DEBUG] Reading resolution tracking file C:\Documents and Settings\jpyeron\Desktop\spring-ws-2.0.2.RELEASE\samples\newrepo\org\codehaus\plexus\plexus-utils\1.1\plexus-utils-1.1.jar.lastUpdated
[DEBUG] Writing resolution tracking file C:\Documents and Settings\jpyeron\Desktop\spring-ws-2.0.2.RELEASE\samples\newrepo\org\codehaus\plexus\plexus-utils\1.1\plexus-utils-1.1.jar.lastUpdated
[DEBUG] Looking up lifecyle mappings for packaging pom from ClassRealm[plexus.core, parent: null]
[ERROR] The build could not read 2 projects -> [Help 1]
org.apache.maven.project.ProjectBuildingException: Some problems were encountered while processing the POMs:
[FATAL] Non-resolvable parent POM: Could not find artifact org.springframework.ws:spring-ws-samples:pom:2.0.2.RELEASE in central (http://repo1.maven.org/maven2) and 'parent.relativePath' points at wrong local POM @ line 3, column 13
[WARNING] 'build.plugins.plugin.version' for org.mortbay.jetty:maven-jetty-plugin is missing. @ line 23, column 21
[WARNING] 'build.plugins.plugin.version' for org.apache.maven.plugins:maven-war-plugin is missing. @ line 27, column 21
[WARNING] The expression ${pom.artifactId} is deprecated. Please use ${project.artifactId} instead. @
[ERROR] Unresolveable build extension: Plugin org.springframework.build.aws:org.springframework.build.aws.maven:3.1.0.RELEASE or one of its dependencies could not be resolved: Could not find artifact org.springframework.build.aws:org.springframework.build.aws.maven:jar:3.1.0.RELEASE in com.springsource.repository.bundles.release (http://repository.springsource.com/maven/bundles/release/) @
[WARNING] 'distributionManagement.repository.id' must not be 'local', this identifier is reserved for the local repository, using it for other repositories will corrupt your repository metadata. @ org.springframework.ws:spring-ws-parent:2.0.2.RELEASE, C:\Documents and Settings\jpyeron\Desktop\spring-ws-2.0.2.RELEASE\samples\newrepo\org\springframework\ws\spring-ws-parent\2.0.2.RELEASE\spring-ws-parent-2.0.2.RELEASE.pom, line 12, column 17
 
        at org.apache.maven.project.DefaultProjectBuilder.build(DefaultProjectBuilder.java:339)
        at org.apache.maven.DefaultMaven.collectProjects(DefaultMaven.java:632)
        at org.apache.maven.DefaultMaven.getProjectsForMavenReactor(DefaultMaven.java:581)
        at org.apache.maven.DefaultMaven.doExecute(DefaultMaven.java:233)
        at org.apache.maven.DefaultMaven.execute(DefaultMaven.java:156)
        at org.apache.maven.cli.MavenCli.execute(MavenCli.java:537)
        at org.apache.maven.cli.MavenCli.doMain(MavenCli.java:196)
        at org.apache.maven.cli.MavenCli.main(MavenCli.java:141)
        at sun.reflect.NativeMethodAccessorImpl.invoke0(Native Method)
        at sun.reflect.NativeMethodAccessorImpl.invoke(NativeMethodAccessorImpl.java:39)
        at sun.reflect.DelegatingMethodAccessorImpl.invoke(DelegatingMethodAccessorImpl.java:25)
        at java.lang.reflect.Method.invoke(Method.java:597)
        at org.codehaus.plexus.classworlds.launcher.Launcher.launchEnhanced(Launcher.java:290)
        at org.codehaus.plexus.classworlds.launcher.Launcher.launch(Launcher.java:230)
        at org.codehaus.plexus.classworlds.launcher.Launcher.mainWithExitCode(Launcher.java:409)
        at org.codehaus.plexus.classworlds.launcher.Launcher.main(Launcher.java:352)
[ERROR]
[ERROR]   The project org.springframework.ws:tutorial:2.0.2.RELEASE (C:\Documents and Settings\jpyeron\Desktop\spring-ws-2.0.2.RELEASE\samples\tutorial\pom.xml) has 1 error
[ERROR]     Non-resolvable parent POM: Could not find artifact org.springframework.ws:spring-ws-samples:pom:2.0.2.RELEASE in central (http://repo1.maven.org/maven2) and 'parent.relativePath' points at wrong local POM @ line 3, column 13 -> [Help 2]
org.apache.maven.model.resolution.UnresolvableModelException: Could not find artifact org.springframework.ws:spring-ws-samples:pom:2.0.2.RELEASE in central (http://repo1.maven.org/maven2)
        at org.apache.maven.project.ProjectModelResolver.resolveModel(ProjectModelResolver.java:159)
        at org.apache.maven.model.building.DefaultModelBuilder.readParentExternally(DefaultModelBuilder.java:819)
        at org.apache.maven.model.building.DefaultModelBuilder.readParent(DefaultModelBuilder.java:691)
        at org.apache.maven.model.building.DefaultModelBuilder.build(DefaultModelBuilder.java:308)
        at org.apache.maven.model.building.DefaultModelBuilder.build(DefaultModelBuilder.java:232)
        at org.apache.maven.project.DefaultProjectBuilder.build(DefaultProjectBuilder.java:386)
        at org.apache.maven.project.DefaultProjectBuilder.build(DefaultProjectBuilder.java:355)
        at org.apache.maven.project.DefaultProjectBuilder.build(DefaultProjectBuilder.java:471)
        at org.apache.maven.project.DefaultProjectBuilder.build(DefaultProjectBuilder.java:355)
        at org.apache.maven.project.DefaultProjectBuilder.build(DefaultProjectBuilder.java:319)
        at org.apache.maven.DefaultMaven.collectProjects(DefaultMaven.java:632)
        at org.apache.maven.DefaultMaven.getProjectsForMavenReactor(DefaultMaven.java:581)
        at org.apache.maven.DefaultMaven.doExecute(DefaultMaven.java:233)
        at org.apache.maven.DefaultMaven.execute(DefaultMaven.java:156)
        at org.apache.maven.cli.MavenCli.execute(MavenCli.java:537)
        at org.apache.maven.cli.MavenCli.doMain(MavenCli.java:196)
        at org.apache.maven.cli.MavenCli.main(MavenCli.java:141)
        at sun.reflect.NativeMethodAccessorImpl.invoke0(Native Method)
        at sun.reflect.NativeMethodAccessorImpl.invoke(NativeMethodAccessorImpl.java:39)
        at sun.reflect.DelegatingMethodAccessorImpl.invoke(DelegatingMethodAccessorImpl.java:25)
        at java.lang.reflect.Method.invoke(Method.java:597)
        at org.codehaus.plexus.classworlds.launcher.Launcher.launchEnhanced(Launcher.java:290)
        at org.codehaus.plexus.classworlds.launcher.Launcher.launch(Launcher.java:230)
        at org.codehaus.plexus.classworlds.launcher.Launcher.mainWithExitCode(Launcher.java:409)
        at org.codehaus.plexus.classworlds.launcher.Launcher.main(Launcher.java:352)
Caused by: org.sonatype.aether.resolution.ArtifactResolutionException: Could not find artifact org.springframework.ws:spring-ws-samples:pom:2.0.2.RELEASE in central (http://repo1.maven.org/maven2)
        at org.sonatype.aether.impl.internal.DefaultArtifactResolver.resolve(DefaultArtifactResolver.java:541)
        at org.sonatype.aether.impl.internal.DefaultArtifactResolver.resolveArtifacts(DefaultArtifactResolver.java:220)
        at org.sonatype.aether.impl.internal.DefaultArtifactResolver.resolveArtifact(DefaultArtifactResolver.java:197)
        at org.sonatype.aether.impl.internal.DefaultRepositorySystem.resolveArtifact(DefaultRepositorySystem.java:323)
        at org.apache.maven.project.ProjectModelResolver.resolveModel(ProjectModelResolver.java:155)
        ... 24 more
Caused by: org.sonatype.aether.transfer.ArtifactNotFoundException: Could not find artifact org.springframework.ws:spring-ws-samples:pom:2.0.2.RELEASE in central (http://repo1.maven.org/maven2)
        at org.sonatype.aether.connector.wagon.WagonRepositoryConnector$4.wrap(WagonRepositoryConnector.java:945)
        at org.sonatype.aether.connector.wagon.WagonRepositoryConnector$4.wrap(WagonRepositoryConnector.java:940)
        at org.sonatype.aether.connector.wagon.WagonRepositoryConnector$GetTask.flush(WagonRepositoryConnector.java:695)
        at org.sonatype.aether.connector.wagon.WagonRepositoryConnector$GetTask.flush(WagonRepositoryConnector.java:689)
        at org.sonatype.aether.connector.wagon.WagonRepositoryConnector.get(WagonRepositoryConnector.java:445)
        at org.sonatype.aether.impl.internal.DefaultArtifactResolver.resolve(DefaultArtifactResolver.java:460)
        ... 28 more
[ERROR]
[ERROR]   The project org.springframework.ws:spring-ws-samples:2.0.2.RELEASE (C:\Documents and Settings\jpyeron\Desktop\spring-ws-2.0.2.RELEASE\samples\pom.xml) has 1 error
[ERROR]     Unresolveable build extension: Plugin org.springframework.build.aws:org.springframework.build.aws.maven:3.1.0.RELEASE or one of its dependencies could not be resolved: Could not find artifact org.springframework.build.aws:org.springframework.build.aws.maven:jar:3.1.0.RELEASE in com.springsource.repository.bundles.release (http://repository.springsource.com/maven/bundles/release/) -> [Help 3]
org.apache.maven.plugin.PluginResolutionException: Plugin org.springframework.build.aws:org.springframework.build.aws.maven:3.1.0.RELEASE or one of its dependencies could not be resolved: Could not find artifact org.springframework.build.aws:org.springframework.build.aws.maven:jar:3.1.0.RELEASE in com.springsource.repository.bundles.release (http://repository.springsource.com/maven/bundles/release/)
        at org.apache.maven.plugin.internal.DefaultPluginDependenciesResolver.resolve(DefaultPluginDependenciesResolver.java:215)
        at org.apache.maven.project.DefaultProjectBuildingHelper.resolveExtensionArtifacts(DefaultProjectBuildingHelper.java:377)
        at org.apache.maven.project.DefaultProjectBuildingHelper.createProjectRealm(DefaultProjectBuildingHelper.java:237)
        at org.apache.maven.project.DefaultModelBuildingListener.buildExtensionsAssembled(DefaultModelBuildingListener.java:106)
        at org.apache.maven.model.building.ModelBuildingEventCatapult$1.fire(ModelBuildingEventCatapult.java:43)
        at org.apache.maven.model.building.DefaultModelBuilder.fireEvent(DefaultModelBuilder.java:1041)
        at org.apache.maven.model.building.DefaultModelBuilder.build(DefaultModelBuilder.java:391)
        at org.apache.maven.model.building.DefaultModelBuilder.build(DefaultModelBuilder.java:374)
        at org.apache.maven.project.DefaultProjectBuilder.build(DefaultProjectBuilder.java:536)
        at org.apache.maven.project.DefaultProjectBuilder.build(DefaultProjectBuilder.java:328)
        at org.apache.maven.DefaultMaven.collectProjects(DefaultMaven.java:632)
        at org.apache.maven.DefaultMaven.getProjectsForMavenReactor(DefaultMaven.java:581)
        at org.apache.maven.DefaultMaven.doExecute(DefaultMaven.java:233)
        at org.apache.maven.DefaultMaven.execute(DefaultMaven.java:156)
        at org.apache.maven.cli.MavenCli.execute(MavenCli.java:537)
        at org.apache.maven.cli.MavenCli.doMain(MavenCli.java:196)
        at org.apache.maven.cli.MavenCli.main(MavenCli.java:141)
        at sun.reflect.NativeMethodAccessorImpl.invoke0(Native Method)
        at sun.reflect.NativeMethodAccessorImpl.invoke(NativeMethodAccessorImpl.java:39)
        at sun.reflect.DelegatingMethodAccessorImpl.invoke(DelegatingMethodAccessorImpl.java:25)
        at java.lang.reflect.Method.invoke(Method.java:597)
        at org.codehaus.plexus.classworlds.launcher.Launcher.launchEnhanced(Launcher.java:290)
        at org.codehaus.plexus.classworlds.launcher.Launcher.launch(Launcher.java:230)
        at org.codehaus.plexus.classworlds.launcher.Launcher.mainWithExitCode(Launcher.java:409)
        at org.codehaus.plexus.classworlds.launcher.Launcher.main(Launcher.java:352)
Caused by: org.sonatype.aether.resolution.ArtifactResolutionException: Could not find artifact org.springframework.build.aws:org.springframework.build.aws.maven:jar:3.1.0.RELEASE in com.springsource.repository.bundles.release (http://repository.springsource.com/maven/bundles/release/)
        at org.sonatype.aether.impl.internal.DefaultArtifactResolver.resolve(DefaultArtifactResolver.java:541)
        at org.sonatype.aether.impl.internal.DefaultArtifactResolver.resolveArtifacts(DefaultArtifactResolver.java:220)
        at org.sonatype.aether.impl.internal.DefaultRepositorySystem.resolveDependencies(DefaultRepositorySystem.java:395)
        at org.apache.maven.plugin.internal.DefaultPluginDependenciesResolver.resolve(DefaultPluginDependenciesResolver.java:207)
        ... 24 more
Caused by: org.sonatype.aether.transfer.ArtifactNotFoundException: Could not find artifact org.springframework.build.aws:org.springframework.build.aws.maven:jar:3.1.0.RELEASE in com.springsource.repository.bundles.release (http://repository.springsource.com/maven/bundles/release/)
        at org.sonatype.aether.connector.wagon.WagonRepositoryConnector$4.wrap(WagonRepositoryConnector.java:945)
        at org.sonatype.aether.connector.wagon.WagonRepositoryConnector$4.wrap(WagonRepositoryConnector.java:940)
        at org.sonatype.aether.connector.wagon.WagonRepositoryConnector$GetTask.flush(WagonRepositoryConnector.java:695)
        at org.sonatype.aether.connector.wagon.WagonRepositoryConnector$GetTask.flush(WagonRepositoryConnector.java:689)
        at org.sonatype.aether.connector.wagon.WagonRepositoryConnector.get(WagonRepositoryConnector.java:445)
        at org.sonatype.aether.impl.internal.DefaultArtifactResolver.resolve(DefaultArtifactResolver.java:460)
        ... 27 more
[ERROR]
[ERROR]
[ERROR] For more information about the errors and possible solutions, please read the following articles:
[ERROR] [Help 1] http://cwiki.apache.org/confluence/display/MAVEN/ProjectBuildingException
[ERROR] [Help 2] http://cwiki.apache.org/confluence/display/MAVEN/UnresolvableModelException
[ERROR] [Help 3] http://cwiki.apache.org/confluence/display/MAVEN/PluginResolutionException



 Comments   
Comment by Jason Pyeron [ 21/Jul/11 ]

http://repo1.maven.org/maven2/org/springframework/ws/spring-ws-samples/
http://repo1.maven.org/maven2/org/springframework/ws/spring-ws-samples/2.0.2.RELEASE/
http://repo1.maven.org/maven2/org/springframework/ws/spring-ws-samples/2.0.2.RELEASE/spring-ws-samples-2.0.2.RELEASE.pom

all return a 404 error.

Comment by Jason Pyeron [ 21/Jul/11 ]

http://repository.springsource.com/maven/bundles/release/org/springframework/build/aws/org.springframework.build.aws.maven/3.1.0.RELEASE/org.springframework.build.aws.maven-3.1.0.RELEASE.jar

gives:

<Error>
<Code>NoSuchKey</Code>
<Message>The specified key does not exist.</Message>
<Key>maven/bundles/release/org/springframework/build/aws/org.springframework.build.aws.maven/3.1.0.RELEASE/org.springframework.build.aws.maven-3.1.0.RELEASE.jar</Key>
<RequestId>3B9DCBC7B5187D5C</RequestId>
<HostId>6jMf+YcxNrXg9avrfKjxK2PNHeuhFBTajjkiZw9xJOGwu31/27ePGdQ80qgS9vQ0</HostId>
</Error>

Comment by Arjen Poutsma [ 06/Oct/11 ]

The samples parent pom is not deployed to any repository, you will need to install it yourself from local sources.

As for the AWS plugin (your last comment), that is now fixed.

Comment by jaminh [ 06/Apr/12 ]

I downloaded Spring WS from trunk today and tried building it and got errors on the AWS plugin. I clicked the link above (http://repository.springsource.com/maven/bundles/release/org/springframework/build/aws/org.springframework.build.aws.maven/3.1.0.RELEASE/org.springframework.build.aws.maven-3.1.0.RELEASE.jar) and got the same NoSuchKey error.

Comment by Arjen Poutsma [ 04/May/12 ]

Closing old issues

Generated at Thu Dec 14 00:24:42 UTC 2017 using JIRA 6.4.14#64029-sha1:ae256fe0fbb912241490ff1cecfb323ea0905ca5.